Reaction Details
TargetGlyceraldehyde-3-phosphate dehydrogenase
LigandBDBM14487
Substrate/Competitorn/a
Meas. Tech.ChEBML_72905
Ki 2500000±n/a nM
Citation Aronov, AMGelb, MH Synthesis and structure-activity relationships of adenosine analogs as inhibitors of trypanosomal glyceraldehyde-3-phosphate dehydrogenase. Modifications at positions 5' and 8. Bioorg Med Chem Lett8:3505-10 (1999) Glyceraldehyde-3-phosphate dehydrogenase
Name:Glyceraldehyde-3-phosphate dehydrogenase
Type:PROTEIN
Mol. Mass.:36060.86
Organism:Homo sapiens (Human)
Description:ChEMBL_1511315
Residue:335
BDBM14487
NameBDBM14487
Synonyms:(2R,3R,4S,5R)-2-(6-amino-9H-purin-9-yl)-5-(hydroxymethyl)oxolane-3,4-diol Adenosine N6-Methylado cid_191 | cid_60961
TypeNucleoside or nucleotide
Emp. Form.C10H13N5O4
Mol. Mass.267.2413
SMILESNc1ncnc2n(cnc12)[C@@H]1O[C@H](CO)[C@@H](O)[C@H]1O