Reaction Details
TargetSubstance-P receptor
LigandBDBM50069863
Substrate/Competitorn/a
Meas. Tech.ChEBML_205567
IC50 0.110000±n/a nM
Citation Rosen, TJCoffman, KJMcLean, SCrawford, RTBryce, DKGohda, YTsuchiya, MNagahisa, ANakane, MLowe, JA Synthesis and structure-activity relationships of CP-122,721, a second-generation NK-1 receptor antagonist. Bioorg Med Chem Lett8:281-4 (1999) Substance-P receptor
Name:Substance-P receptor
Type:G Protein-Coupled Receptor (GPCR)
Mol. Mass.:46254.43
Organism:Homo sapiens (Human)
Description:P25103
Residue:407
BDBM50069863
NameBDBM50069863
Synonyms:CHEMBL329007 | N-{4-Methoxy-3-[((2S,3S)-2-phenyl-piperidin-3-ylamino)-methyl]-phenyl}-N-methyl-methanesulfonamide
TypeSmall organic molecule
Emp. Form.C21H29N3O3S
Mol. Mass.403.538
SMILESCOc1ccc(cc1CN[C@H]1CCCN[C@H]1c1ccccc1)N(C)S(C)(=O)=O