Reaction Details
TargetSubstance-P receptor
LigandBDBM50069867
Substrate/Competitorn/a
Meas. Tech.ChEBML_205567
IC50 0.460000±n/a nM
Citation Rosen, TJCoffman, KJMcLean, SCrawford, RTBryce, DKGohda, YTsuchiya, MNagahisa, ANakane, MLowe, JA Synthesis and structure-activity relationships of CP-122,721, a second-generation NK-1 receptor antagonist. Bioorg Med Chem Lett8:281-4 (1999) Substance-P receptor
Name:Substance-P receptor
Type:G Protein-Coupled Receptor (GPCR)
Mol. Mass.:46254.43
Organism:Homo sapiens (Human)
Description:P25103
Residue:407
BDBM50069867
NameBDBM50069867
Synonyms:(2-Isopropoxy-benzyl)-((2S,3S)-2-phenyl-piperidin-3-yl)-amine | CHEMBL95315
TypeSmall organic molecule
Emp. Form.C21H28N2O
Mol. Mass.324.4598
SMILESCC(C)Oc1ccccc1CN[C@H]1CCCN[C@H]1c1ccccc1