Reaction Details
TargetSodium-dependent serotonin transporter
LigandBDBM50069447
Substrate/Competitorn/a
Meas. Tech.ChEBML_184250
Ki 137±n/a nM
Citation Carlier, PRLo, MMLo, PCRichelson, ETatsumi, MReynolds, IJSharma, TA Synthesis of a potent wide-spectrum serotonin-, norepinephrine-, dopamine-reuptake inhibitor (SNDRI) and a species-selective dopamine-reuptake inhibitor based on the gamma-amino alcohol functional group. Bioorg Med Chem Lett8:487-92 (1999) Sodium-dependent serotonin transporter
Name:Sodium-dependent serotonin transporter
Type:Multi-pass membrane protein
Mol. Mass.:70168.43
Organism:Rattus norvegicus (rat)
Description:P31652
Residue:630
BDBM50069447
NameBDBM50069447
Synonyms:1-(3-(4-(m-Chlorophenyl)-1-piperazinyl)propyl)-3-ethyl-4-(2-phenoxyethyl)-delta2-1,2,4-triazolin-5-one CHEMBL623 US9138393, Nefazodone HCl | US9144538, Nefazodone HCl
TypeSmall organic molecule
Emp. Form.C25H32ClN5O2
Mol. Mass.470.007
SMILESCCc1nn(CCCN2CCN(CC2)c2cccc(Cl)c2)c(=O)n1CCOc1ccccc1