Reaction Details
TargetSodium-dependent serotonin transporter
LigandBDBM22416
Substrate/Competitorn/a
Meas. Tech.ChEBML_201359
Kd 0.130000±n/a nM
Citation Carlier, PRLo, MMLo, PCRichelson, ETatsumi, MReynolds, IJSharma, TA Synthesis of a potent wide-spectrum serotonin-, norepinephrine-, dopamine-reuptake inhibitor (SNDRI) and a species-selective dopamine-reuptake inhibitor based on the gamma-amino alcohol functional group. Bioorg Med Chem Lett8:487-92 (1999) Sodium-dependent serotonin transporter
Name:Sodium-dependent serotonin transporter
Type:Multi-pass membrane protein
Mol. Mass.:70322.51
Organism:Homo sapiens (Human)
Description:P31645
Residue:630
BDBM22416
NameBDBM22416
Synonyms:(3S,4R)-3-[(1,3-benzodioxol-5-yloxy)methyl]-4-(4-fluorophenyl)piperidine CHEMBL490 US09969700, Paroxetine [3H]Paroxetine
Typeradiolabeled ligand
Emp. Form.C19H20FNO3
Mol. Mass.329.3654
SMILESFc1ccc(cc1)[C@@H]1CCNC[C@H]1COc1ccc2OCOc2c1