Reaction Details
TargetAdenosine receptor A2a
LigandBDBM50366576
Substrate/Competitorn/a
Meas. Tech.ChEBML_30930
Ki 13500±n/a nM
Citation Camp, DLi, YMcCluskey, AMoni, RWQuinn, RJ Diimidazo[1,2-c:4',5'-e]pyrimidines: N6-N1 conformationally restricted adenosines. Bioorg Med Chem Lett8:695-8 (1999) Adenosine receptor A2a
Name:Adenosine receptor A2a
Type:G Protein-Coupled Receptor (GPCR)
Mol. Mass.:45015.65
Organism:Rattus norvegicus (rat)
Description:Rat A2A receptors expressed in CHO cells.
Residue:410
BDBM50366576
NameBDBM50366576
Synonyms:CHEMBL609546
TypeSmall organic molecule
Emp. Form.C19H21N5O4
Mol. Mass.383.4011
SMILESOC[C@@H]1OC([C@@H](O)[C@H]1O)n1cnc2C3=N[C@H](Cc4ccccc4)CN3C=Nc12