Reaction Details
TargetAdenosine receptor A2a
LigandBDBM50004714
Substrate/Competitorn/a
Meas. Tech.ChEBML_30930
Ki 3300±n/a nM
Citation Camp, DLi, YMcCluskey, AMoni, RWQuinn, RJ Diimidazo[1,2-c:4',5'-e]pyrimidines: N6-N1 conformationally restricted adenosines. Bioorg Med Chem Lett8:695-8 (1999) Adenosine receptor A2a
Name:Adenosine receptor A2a
Type:G Protein-Coupled Receptor (GPCR)
Mol. Mass.:45015.65
Organism:Rattus norvegicus (rat)
Description:Rat A2A receptors expressed in CHO cells.
Residue:410
BDBM50004714
NameBDBM50004714
Synonyms:(S)-2-Benzyl-7-phenyl-5-propoxy-2,7-dihydro-3H-imidazo[1,2-c]pyrazolo[4,3-e]pyrimidine CHEMBL110426
TypeSmall organic molecule
Emp. Form.C23H23N5O
Mol. Mass.385.4616
SMILESCCCOC1=Nc2c(cnn2-c2ccccc2)C2=N[C@@H](Cc3ccccc3)CN12