Reaction Details
TargetMacrophage metalloelastase
LigandBDBM50068848
Substrate/Competitorn/a
Meas. Tech.ChEBML_103854
IC50 4.8±n/a nM
Citation Jeng, AYChou, MParker, DT Sulfonamide-based hydroxamic acids as potent inhibitors of mouse macrophage metalloelastase. Bioorg Med Chem Lett8:897-902 (1999) Macrophage metalloelastase
Name:Macrophage metalloelastase
Type:PROTEIN
Mol. Mass.:54988.61
Organism:Mus musculus
Description:ChEMBL_796155
Residue:473
BDBM50068848
NameBDBM50068848
Synonyms:(2R,4R)-2-[Benzyl-(4-methoxy-benzenesulfonyl)-amino]-4-methyl-hexanoic acid hydroxyamide | CHEMBL170601
TypeSmall organic molecule
Emp. Form.C21H28N2O5S
Mol. Mass.420.522
SMILESCC[C@@H](C)C[C@@H](N(Cc1ccccc1)S(=O)(=O)c1ccc(OC)cc1)C(=O)NO