Reaction Details
TargetGlycogen phosphorylase, liver form
LigandBDBM50215446
Substrate/Competitorn/a
Meas. Tech.ChEMBL_99189 (CHEMBL711967)
Ki 16500±n/a nM
Citation Osz, ESomsák, LSzilágyi, LKovács, LDocsa, TTóth, BGergely, P Efficient inhibition of muscle and liver glycogen phosphorylases by a new glucopyranosylidene-spiro-thiohydantoin. Bioorg Med Chem Lett9:1385-90 (1999) Glycogen phosphorylase, liver form
Name:Glycogen phosphorylase, liver form
Type:PROTEIN
Mol. Mass.:97489.46
Organism:Rattus norvegicus
Description:ChEMBL_1491377
Residue:850
BDBM50215446
NameBDBM50215446
Synonyms:CHEMBL3351144
TypeSmall organic molecule
Emp. Form.C8H12N2O7
Mol. Mass.248.1901
SMILESOC[C@@H]1O[C@@]2(NC(=O)NC2=O)[C@@H](O)[C@@H](O)[C@@H]1O