Reaction Details
TargetCalcium dependent protein kinase
LigandBDBM50366582
Substrate/Competitorn/a
Meas. Tech.ChEBML_42944
IC50 19000±n/a nM
Citation Loog, MUri, ARaidaru, GJärv, JEk, P Adenosine-5'-carboxylic acid peptidyl derivatives as inhibitors of protein kinases. Bioorg Med Chem Lett9:1447-52 (1999) Calcium dependent protein kinase
Name:Calcium dependent protein kinase
Synonyms:CaM kinase I alpha
Type:PROTEIN
Mol. Mass.:54720.70
Organism:Zea mays
Description:ChEMBL_42944
Residue:492
BDBM50366582
NameBDBM50366582
Synonyms:CHEMBL611125
TypeSmall organic molecule
Emp. Form.C50H90N30O12
Mol. Mass.1303.4434
SMILESNC(=N)NCCC[C@@H](NC(=O)[C@@H](CCCNC(N)=N)NC(=O)[C@@H](CCCNC(N)=N)NC(=O)[C@@H](CCCNC(N)=N)NC(=O)[C@@H](CCCNC(N)=N)NC(=O)[C@@H](CCCNC(N)=N)NC(=O)CCCNC(=O)[C@H]1OC([C@H](O)[C@@H]1O)n1cnc2c(N)ncnc12)C(O)=O