Reaction Details
TargetCalcium dependent protein kinase
LigandBDBM50366585
Substrate/Competitorn/a
Meas. Tech.ChEBML_42944
IC50 31000±n/a nM
Citation Loog, MUri, ARaidaru, GJärv, JEk, P Adenosine-5'-carboxylic acid peptidyl derivatives as inhibitors of protein kinases. Bioorg Med Chem Lett9:1447-52 (1999) Calcium dependent protein kinase
Name:Calcium dependent protein kinase
Synonyms:CaM kinase I alpha
Type:PROTEIN
Mol. Mass.:54720.70
Organism:Zea mays
Description:ChEMBL_42944
Residue:492
BDBM50366585
NameBDBM50366585
Synonyms:CHEMBL611120
TypeSmall organic molecule
Emp. Form.C58H101N31O13
Mol. Mass.1440.6224
SMILESC[C@@H](N1CCC[C@H]1C(=O)N1CCC[C@@H]1C(=O)[C@H]1OC([C@H](O)[C@@H]1O)n1cnc2c(N)ncnc12)C(=O)N[C@H](CCCNC(N)=N)C(=O)N[C@H](CCCNC(N)=N)C(=O)N[C@H](CCCNC(N)=N)C(=O)N[C@H](CCCNC(N)=N)C(=O)N[C@H](CCCNC(N)=N)C(=O)N[C@H](CCCNC(N)=N)C(O)=O