Reaction Details
TargetCalcium dependent protein kinase
LigandBDBM50366589
Substrate/Competitorn/a
Meas. Tech.ChEBML_42944
IC50 16000±n/a nM
Citation Loog, MUri, ARaidaru, GJärv, JEk, P Adenosine-5'-carboxylic acid peptidyl derivatives as inhibitors of protein kinases. Bioorg Med Chem Lett9:1447-52 (1999) Calcium dependent protein kinase
Name:Calcium dependent protein kinase
Synonyms:CaM kinase I alpha
Type:PROTEIN
Mol. Mass.:54720.70
Organism:Zea mays
Description:ChEMBL_42944
Residue:492
BDBM50366589
NameBDBM50366589
Synonyms:CHEMBL610875
TypeSmall organic molecule
Emp. Form.C55H98N32O14
Mol. Mass.1431.5726
SMILESC[C@@H](NC(=O)CCNC(=O)CCNC(=O)[C@H]1OC([C@H](O)[C@@H]1O)n1cnc2c(N)ncnc12)C(=O)N[C@H](CCCNC(N)=N)C(=O)N[C@H](CCCNC(N)=N)C(=O)N[C@H](CCCNC(N)=N)C(=O)N[C@H](CCCNC(N)=N)C(=O)N[C@H](CCCNC(N)=N)C(=O)N[C@H](CCCNC(N)=N)C(O)=O