Reaction Details
TargetCalcium dependent protein kinase
LigandBDBM50077788
Substrate/Competitorn/a
Meas. Tech.ChEBML_42944
IC50>50000±n/a nM
Citation Loog, MUri, ARaidaru, GJärv, JEk, P Adenosine-5'-carboxylic acid peptidyl derivatives as inhibitors of protein kinases. Bioorg Med Chem Lett9:1447-52 (1999) Calcium dependent protein kinase
Name:Calcium dependent protein kinase
Synonyms:CaM kinase I alpha
Type:PROTEIN
Mol. Mass.:54720.70
Organism:Zea mays
Description:ChEMBL_42944
Residue:492
BDBM50077788
NameBDBM50077788
TypeSmall organic molecule
Emp. Form.C36H74N24O7
Mol. Mass.955.1294
SMILES[#7]-[#6@H](-[#6]-[#6]-[#6]\[#7]=[#6](/[#7])-[#7])-[#6](=O)-[#7]-[#6@H](-[#6]-[#6]-[#6]-[#7]-[#6](-[#7])=[#7])-[#6](=O)-[#7]-[#6@H](-[#6]-[#6]-[#6]-[#7]-[#6](-[#7])=[#7])-[#6](=O)-[#7]-[#6@H](-[#6]-[#6]-[#6]-[#7]-[#6](-[#7])=[#7])-[#6](=O)-[#7]-[#6@H](-[#6]-[#6]-[#6]-[#7]-[#6](-[#7])=[#7])-[#6](=O)-[#7]-[#6@H](-[#6]-[#6]-[#6]\[#7]=[#6](/[#7])-[#7])-[#6](-[#8])=O