Reaction Details
TargetAminopeptidase N
LigandBDBM50078137
Substrate/Competitorn/a
Meas. Tech.ChEBML_35500
Ki 6.3±n/a nM
Citation Chen, HRoques, BPFournié-Zaluski, MC Design of the first highly potent and selective aminopeptidase N (EC 3.4.11.2) inhibitor. Bioorg Med Chem Lett9:1511-6 (1999) Aminopeptidase N
Name:Aminopeptidase N
Type:Protein
Mol. Mass.:108810.25
Organism:Sus scrofa (Pig)
Description:P15145
Residue:963
BDBM50078137
NameBDBM50078137
Synonyms:2-{3-[(1-Amino-3-methylsulfanyl-propyl)-hydroxy-phosphinoyl]-2-benzyl-propionylamino}-3-phenyl-propionic acid | CHEMBL288597
TypeSmall organic molecule
Emp. Form.C23H31N2O5PS
Mol. Mass.478.541
SMILESCSCCC(=N)P(O)(O)CC(Cc1ccccc1)C(=O)NC(Cc1ccccc1)C(O)=O