Reaction Details
TargetAminopeptidase N
LigandBDBM50078125
Substrate/Competitorn/a
Meas. Tech.ChEMBL_35500 (CHEMBL646410)
Ki 130±n/a nM
Citation Chen, HRoques, BPFournié-Zaluski, MC Design of the first highly potent and selective aminopeptidase N (EC 3.4.11.2) inhibitor. Bioorg Med Chem Lett9:1511-6 (1999) Aminopeptidase N
Name:Aminopeptidase N
Type:Protein
Mol. Mass.:108810.25
Organism:Sus scrofa (Pig)
Description:P15145
Residue:963
BDBM50078125
NameBDBM50078125
Synonyms:(1-Amino-3-phenyl-propyl)-phosphinic acid | CHEMBL289824
TypeSmall organic molecule
Emp. Form.C9H12NO2P
Mol. Mass.197.1708
SMILESOP(O)C(=N)CCc1ccccc1