Reaction Details
TargetReverse transcriptase/RNaseH
LigandBDBM1866
Substrate/Competitorn/a
Meas. Tech.ChEBML_195505
IC50 800±n/a nM
Citation Mao, CSudbeck, EAVenkatachalam, TKUckun, FM Rational design of N-[2-(2,5-dimethoxyphenylethyl)]-N'-[2-(5-bromopyridyl)]-thiourea (HI-236) as a potent non-nucleoside inhibitor of drug-resistant human immunodeficiency virus. Bioorg Med Chem Lett9:1593-8 (1999) Reverse transcriptase/RNaseH
Name:Reverse transcriptase/RNaseH
Type:PROTEIN
Mol. Mass.:65229.15
Organism:Human immunodeficiency virus 1
Description:ChEMBL_1473730
Residue:566
BDBM1866
NameBDBM1866
Synonyms:3-(5-bromopyridin-2-yl)-1-[2-(pyridin-2-yl)ethyl]thiourea hydrochloride LY300046HCl PETT deriv. | Trovirdine
TypeSmall organic molecule
Emp. Form.C13H13BrN4S
Mol. Mass.337.238
SMILESBrc1ccc(NC(=S)NCCc2ccccn2)nc1