Reaction Details
TargetCollagenase 3
LigandBDBM50063917
Substrate/Competitorn/a
Meas. Tech.ChEBML_101903
IC50 3.5±n/a nM
Citation Hanessian, SBouzbouz, SBoudon, ATucker, GCPeyroulan, D Picking the S1, S1' and S2' pockets of matrix metalloproteinases. A niche for potent acyclic sulfonamide inhibitors. Bioorg Med Chem Lett9:1691-6 (1999) Collagenase 3
Name:Collagenase 3
Type:Enzyme
Mol. Mass.:53808.06
Organism:Homo sapiens (Human)
Description:P45452
Residue:471
BDBM50063917
NameBDBM50063917
Synonyms:(2S,3R)-N(4)-[(2S)-3,3-dimethyl-1-(methylamino)-1-oxobutan-2-yl]-N(1),2-dihydroxy-3-(2-methylpropyl)butanediamide cid_119031 | marimastat
TypeSmall organic molecule
Emp. Form.C15H29N3O5
Mol. Mass.331.4079
SMILESCNC(=O)[C@@H](NC(=O)[C@H](CC(C)C)[C@H](O)C(=O)NO)C(C)(C)C