Reaction Details
Target72 kDa type IV collagenase
LigandBDBM50078566
Substrate/Competitorn/a
Meas. Tech.ChEBML_101907
IC50 0.700000±n/a nM
Citation Hanessian, SBouzbouz, SBoudon, ATucker, GCPeyroulan, D Picking the S1, S1' and S2' pockets of matrix metalloproteinases. A niche for potent acyclic sulfonamide inhibitors. Bioorg Med Chem Lett9:1691-6 (1999) 72 kDa type IV collagenase
Name:72 kDa type IV collagenase
Type:Enzyme
Mol. Mass.:73870.36
Organism:Homo sapiens (Human)
Description: P08253
Residue:660
BDBM50078566
NameBDBM50078566
Synonyms:(S)-4-Benzylsulfanyl-N-hydroxy-2-[isobutyl-(4-methoxy-benzenesulfonyl)-amino]-butyramide | CHEMBL296911
TypeSmall organic molecule
Emp. Form.C22H30N2O5S2
Mol. Mass.466.614
SMILESCOc1ccc(cc1)S(=O)(=O)N(CC(C)C)[C@@H](CCSCc1ccccc1)C(=O)NO