Reaction Details
TargetProstaglandin G/H synthase 1
LigandBDBM22369
Substrate/Competitorn/a
Meas. Tech.ChEMBL_158744 (CHEMBL768751)
IC50>15000±n/a nM
Citation Prasit, PWang, ZBrideau, CChan, CCCharleson, SCromlish, WEthier, DEvans, JFFord-Hutchinson, AWGauthier, JYGordon, RGuay, JGresser, MKargman, SKennedy, BLeblanc, YLéger, SMancini, JO'Neill, GPOuellet, MPercival, MDPerrier, HRiendeau, DRodger, IZamboni, R The discovery of rofecoxib, [MK 966, Vioxx, 4-(4'-methylsulfonylphenyl)-3-phenyl-2(5H)-furanone], an orally active cyclooxygenase-2-inhibitor. Bioorg Med Chem Lett9:1773-8 (1999) Prostaglandin G/H synthase 1
Name:Prostaglandin G/H synthase 1
Type:Enzyme
Mol. Mass.:68692.62
Organism:Homo sapiens (Human)
Description:P23219
Residue:599
BDBM22369
NameBDBM22369
Synonyms:4-(4-methanesulfonylphenyl)-3-phenyl-2,5-dihydrofuran-2-one MK 0966 US11478464, Compound Rofecoxib | US11786535, Compound Rofecoxib
TypeSmall organic molecule
Emp. Form.C17H14O4S
Mol. Mass.314.356
SMILESCS(=O)(=O)c1ccc(cc1)C1=C(C(=O)OC1)c1ccccc1