Reaction Details
TargetSodium-dependent dopamine transporter
LigandBDBM50078778
Substrate/Competitorn/a
Meas. Tech.ChEBML_62329
Ki 23000±n/a nM
Citation Kozikowski, APSimoni, DRoberti, MRondanin, RWang, SDu, PJohnson, KM Synthesis of 8-Oxa analogues of norcocaine endowed with interesting cocaine-like activity. Bioorg Med Chem Lett9:1831-6 (1999) Sodium-dependent dopamine transporter
Name:Sodium-dependent dopamine transporter
Type:Multi-pass membrane protein
Mol. Mass.:68749.45
Organism:Rattus norvegicus (rat)
Description:P23977
Residue:619
BDBM50078778
NameBDBM50078778
Synonyms:(2R,3R)-3-Benzoyloxy-8-oxa-bicyclo[3.2.1]octane-2-carboxylic acid methyl ester | CHEMBL299297
TypeSmall organic molecule
Emp. Form.C16H18O5
Mol. Mass.290.3111
SMILESCOC(=O)[C@@H]1C2CCC(C[C@H]1OC(=O)c1ccccc1)O2