Reaction Details
TargetCannabinoid receptor 1
LigandBDBM50080105
Substrate/Competitorn/a
Meas. Tech.ChEMBL_46441 (CHEMBL873195)
Ki 0.820000±n/a nM
Citation Kanyonyo, MGovaerts, SJHermans, EPoupaert, JHLambert, DM 3-Alkyl-(5,5'-diphenyl)imidazolidineiones as new cannabinoid receptor ligands. Bioorg Med Chem Lett9:2233-6 (1999) Cannabinoid receptor 1
Name:Cannabinoid receptor 1
Type:G Protein-Coupled Receptor (GPCR)
Mol. Mass.:52868.96
Organism:Homo sapiens (Human)
Description:P21554
Residue:472
BDBM50080105
NameBDBM50080105
Synonyms:(3-(1,1-Dimethyl-heptyl)-9-hydroxymethyl-6,6-dimethyl-6a,7,8,10a-tetrahydro-6H-benzo[c]chromen-1-ol (HU210) CHEMBL70625
TypeSmall organic molecule
Emp. Form.C25H40O3
Mol. Mass.388.5833
SMILESCCCCCCC(C)(C)c1cc(O)c2[C@@H]3CC(CO)CC[C@H]3C(C)(C)Oc2c1