Reaction Details
TargetCathepsin D
LigandBDBM50080960
Substrate/Competitorn/a
Meas. Tech.ChEBML_45153
IC50 0.700000±n/a nM
Citation Dumas, JBrittelli, DChen, JDixon, BHatoum-Mokdad, HKönig, GSibley, RWitowsky, JWong, S Synthesis and structure activity relationships of novel small molecule cathepsin D inhibitors. Bioorg Med Chem Lett9:2531-6 (1999) Cathepsin D
Name:Cathepsin D
Type:Enzyme
Mol. Mass.:44551.72
Organism:Homo sapiens (Human)
Description:Human proCathepsin D (SwissProt accession number P07339) was expressed in Sf9 cells, purified, and autoactivated.
Residue:412
BDBM50080960
NameBDBM50080960
Synonyms:2-Bromo-N-[(1S,2S)-3-{[2-(2,4-dichloro-phenyl)-ethyl]-[3-(1,3-dioxo-1,3-dihydro-isoindol-2-yl)-propionyl]-amino}-2-hydroxy-1-(3-phenoxy-benzyl)-propyl]-4,5-dimethoxy-benzamide CHEMBL81927
TypeSmall organic molecule
Emp. Form.C44H40BrCl2N3O8
Mol. Mass.889.614
SMILESCOc1cc(Br)c(cc1OC)C(=O)N[C@@H](Cc1cccc(Oc2ccccc2)c1)[C@@H](O)CN(CCc1ccc(Cl)cc1Cl)C(=O)CCN1C(=O)c2ccccc2C1=O