Reaction Details
TargetCoagulation factor X
LigandBDBM13281
Substrate/Competitorn/a
Meas. Tech.ChEBML_48479
Ki 6±n/a nM
Citation Choi-Sledeski, YMBecker, MRGreen, DMDavis, REwing, WRMason, HJLy, CSpada, ALiang, GCheney, DBarton, JChu, VBrown, KColussi, DBentley, RLeadley, RDunwiddie, CPauls, HW Aminoisoquinolines: design and synthesis of an orally active benzamidine isostere for the inhibition of factor XA. Bioorg Med Chem Lett9:2539-44 (1999) Coagulation factor X
Name:Coagulation factor X
Type:PROTEIN
Mol. Mass.:54498.45
Organism:Bos taurus
Description:ChEMBL_1364435
Residue:492
BDBM13281
NameBDBM13281
Synonyms:4-Amino-3-[3-(S)-(7-methoxynaphthalen-2-ylsulfonylamino)-2-oxopyrrolidin-1-ylmethyl]benzamidine Sulfonamidopyrrolidinone 4a
TypeSmall organic molecule
Emp. Form.C23H25N5O4S
Mol. Mass.467.541
SMILESCOc1ccc2ccc(cc2c1)S(=O)(=O)N[C@H]1CCN(Cc2cc(ccc2N)C(N)=N)C1=O