Reaction Details
TargetCoagulation factor X
LigandBDBM50081004
Substrate/Competitorn/a
Meas. Tech.ChEBML_48479
Ki 250±n/a nM
Citation Choi-Sledeski, YMBecker, MRGreen, DMDavis, REwing, WRMason, HJLy, CSpada, ALiang, GCheney, DBarton, JChu, VBrown, KColussi, DBentley, RLeadley, RDunwiddie, CPauls, HW Aminoisoquinolines: design and synthesis of an orally active benzamidine isostere for the inhibition of factor XA. Bioorg Med Chem Lett9:2539-44 (1999) Coagulation factor X
Name:Coagulation factor X
Type:PROTEIN
Mol. Mass.:54498.45
Organism:Bos taurus
Description:ChEMBL_1364435
Residue:492
BDBM50081004
NameBDBM50081004
Synonyms:7-Methoxy-naphthalene-2-sulfonic acid [1-(4-amino-thieno[3,2-c]pyridin-2-ylmethyl)-2-oxo-pyrrolidin-3-yl]-amide | CHEMBL83532
TypeSmall organic molecule
Emp. Form.C23H22N4O4S2
Mol. Mass.482.575
SMILESCOc1ccc2ccc(cc2c1)S(=O)(=O)NC1CCN(Cc2cc3c(N)nccc3s2)C1=O