Reaction Details
TargetCoagulation factor X
LigandBDBM50081008
Substrate/Competitorn/a
Meas. Tech.ChEBML_48479
Ki 80±n/a nM
Citation Choi-Sledeski, YMBecker, MRGreen, DMDavis, REwing, WRMason, HJLy, CSpada, ALiang, GCheney, DBarton, JChu, VBrown, KColussi, DBentley, RLeadley, RDunwiddie, CPauls, HW Aminoisoquinolines: design and synthesis of an orally active benzamidine isostere for the inhibition of factor XA. Bioorg Med Chem Lett9:2539-44 (1999) Coagulation factor X
Name:Coagulation factor X
Type:PROTEIN
Mol. Mass.:54498.45
Organism:Bos taurus
Description:ChEMBL_1364435
Residue:492
BDBM50081008
NameBDBM50081008
Synonyms:7-Methoxy-naphthalene-2-sulfonic acid [(S)-1-(1,6-diamino-isoquinolin-7-ylmethyl)-2-oxo-pyrrolidin-3-yl]-amide | CHEMBL86026
TypeSmall organic molecule
Emp. Form.C25H25N5O4S
Mol. Mass.491.562
SMILESCOc1ccc2ccc(cc2c1)S(=O)(=O)N[C@H]1CCN(Cc2cc3c(N)nccc3cc2N)C1=O