Reaction Details
TargetAlpha-1A adrenergic receptor
LigandBDBM50081818
Substrate/Competitorn/a
Meas. Tech.ChEMBL_32884 (CHEMBL648787)
Ki 5.90±n/a nM
Citation Marzabadi, MRHong, XNagarathnam, DMiao, SWChiu, GWong, WCWetzel, JMFang, JForray, CChen, TBO'Malley, SSChang, RSGluchowski, C Design and synthesis of novel dihydropyridine alpha-1a antagonists. Bioorg Med Chem Lett9:2843-8 (1999) Alpha-1A adrenergic receptor
Name:Alpha-1A adrenergic receptor
Type:Cell-surface receptors
Mol. Mass.:51511.67
Organism:Homo sapiens (Human)
Description:P35348
Residue:466
BDBM50081818
NameBDBM50081818
Synonyms:2-(2-Amino-ethoxymethyl)-6-ethyl-4-(4-nitro-phenyl)-1,4-dihydro-pyridine-3,5-dicarboxylic acid 5-amide 3-{[3-(4,4-diphenyl-piperidin-1-yl)-propyl]-amide} | CHEMBL323579
TypeSmall organic molecule
Emp. Form.C38H46N6O5
Mol. Mass.666.809
SMILESCCC1=NC(COCCN)=C(C(C1C(N)=O)c1ccc(cc1)[N+]([O-])=O)C(=O)NCCCN1CCC(CC1)(c1ccccc1)c1ccccc1