Reaction Details
TargetAlpha-1A adrenergic receptor
LigandBDBM79180
Substrate/Competitorn/a
Meas. Tech.ChEBML_33606
Ki 2344±n/a nM
Citation Marzabadi, MRHong, XNagarathnam, DMiao, SWChiu, GWong, WCWetzel, JMFang, JForray, CChen, TBO'Malley, SSChang, RSGluchowski, C Design and synthesis of novel dihydropyridine alpha-1a antagonists. Bioorg Med Chem Lett9:2843-8 (1999) Alpha-1A adrenergic receptor
Name:Alpha-1A adrenergic receptor
Type:Cell-surface receptors
Mol. Mass.:51511.67
Organism:Homo sapiens (Human)
Description:P35348
Residue:466
BDBM79180
NameBDBM79180
Synonyms:2-(2-aminoethoxymethyl)-4-(2-chlorophenyl)-6-methyl-1,4-dihydropyridine-3,5-dicarboxylic acid O3-ethyl ester O5-methyl ester;benzenesulfonic acid AMLODIPINE SMR000814710 benzenesulfonic acid;O3-ethyl O5-methyl 2-(2-azanylethoxymethyl)-4-(2-chlorophenyl)-6-methyl-1,4-dihydropyridine-3,5-dicarboxylate | cid_60496
TypeSmall organic molecule
Emp. Form.C20H25ClN2O5
Mol. Mass.408.876
SMILESCCOC(=O)C1=C(COCCN)N=C(C)C(C1c1ccccc1Cl)C(=O)OC