Reaction Details
TargetAlpha-1A adrenergic receptor
LigandBDBM29568
Substrate/Competitorn/a
Meas. Tech.ChEMBL_33606 (CHEMBL652813)
Ki 0.580000±n/a nM
Citation Marzabadi, MRHong, XNagarathnam, DMiao, SWChiu, GWong, WCWetzel, JMFang, JForray, CChen, TBO'Malley, SSChang, RSGluchowski, C Design and synthesis of novel dihydropyridine alpha-1a antagonists. Bioorg Med Chem Lett9:2843-8 (1999) Alpha-1A adrenergic receptor
Name:Alpha-1A adrenergic receptor
Type:Cell-surface receptors
Mol. Mass.:51511.67
Organism:Homo sapiens (Human)
Description:P35348
Residue:466
BDBM29568
NameBDBM29568
Synonyms:CHEMBL2 PRAZOSIN HYDROCHLORIDE [3H]-Minipress [3H]-Prazosin
Typeradiolabeled ligand
Emp. Form.C19H21N5O4
Mol. Mass.383.4011
SMILESCOc1cc2nc(nc(N)c2cc1OC)N1CCN(CC1)C(=O)c1ccco1