Reaction Details
TargetVoltage-dependent L-type calcium channel subunit alpha-1C
LigandBDBM50366618
Substrate/Competitorn/a
Meas. Tech.ChEMBL_184418 (CHEMBL791520)
Ki 670±n/a nM
Citation Marzabadi, MRHong, XNagarathnam, DMiao, SWChiu, GWong, WCWetzel, JMFang, JForray, CChen, TBO'Malley, SSChang, RSGluchowski, C Design and synthesis of novel dihydropyridine alpha-1a antagonists. Bioorg Med Chem Lett9:2843-8 (1999) Voltage-dependent L-type calcium channel subunit alpha-1C
Name:Voltage-dependent L-type calcium channel subunit alpha-1C
Type:Enzyme Catalytic Domain
Mol. Mass.:243492.26
Organism:RAT
Description:Calcium channel 0 RAT::P22002
Residue:2169
BDBM50366618
NameBDBM50366618
Synonyms:CHEMBL448620 | SNAP-5089
TypeSmall organic molecule
Emp. Form.C36H40N4O5
Mol. Mass.608.7266
SMILESCOC(=O)C1C(C(C(=O)NCCCN2CCC(CC2)(c2ccccc2)c2ccccc2)=C(C)N=C1C)c1ccc(cc1)[N+]([O-])=O