Reaction Details
TargetAlpha-1A adrenergic receptor
LigandBDBM50081819
Substrate/Competitorn/a
Meas. Tech.ChEBML_33606
Ki 3.8±n/a nM
Citation Marzabadi, MRHong, XNagarathnam, DMiao, SWChiu, GWong, WCWetzel, JMFang, JForray, CChen, TBO'Malley, SSChang, RSGluchowski, C Design and synthesis of novel dihydropyridine alpha-1a antagonists. Bioorg Med Chem Lett9:2843-8 (1999) Alpha-1A adrenergic receptor
Name:Alpha-1A adrenergic receptor
Type:Cell-surface receptors
Mol. Mass.:51511.67
Organism:Homo sapiens (Human)
Description:P35348
Residue:466
BDBM50081819
NameBDBM50081819
Synonyms:2-Ethyl-4-(4-nitro-phenyl)-6-propyl-1,4-dihydro-pyridine-3,5-dicarboxylic acid 5-{[3-(4,4-diphenyl-piperidin-1-yl)-propyl]-amide} 3-ethylamide | CHEMBL316495
TypeSmall organic molecule
Emp. Form.C40H49N5O4
Mol. Mass.663.8482
SMILESCCCC1=C(C(C(C(=O)NCC)C(CC)=N1)c1ccc(cc1)[N+]([O-])=O)C(=O)NCCCN1CCC(CC1)(c1ccccc1)c1ccccc1