Reaction Details
TargetAlpha-1A adrenergic receptor
LigandBDBM50081831
Substrate/Competitorn/a
Meas. Tech.ChEBML_33606
Ki 3±n/a nM
Citation Marzabadi, MRHong, XNagarathnam, DMiao, SWChiu, GWong, WCWetzel, JMFang, JForray, CChen, TBO'Malley, SSChang, RSGluchowski, C Design and synthesis of novel dihydropyridine alpha-1a antagonists. Bioorg Med Chem Lett9:2843-8 (1999) Alpha-1A adrenergic receptor
Name:Alpha-1A adrenergic receptor
Type:Cell-surface receptors
Mol. Mass.:51511.67
Organism:Homo sapiens (Human)
Description:P35348
Residue:466
BDBM50081831
NameBDBM50081831
Synonyms:2-(2-Amino-ethoxymethyl)-6-ethyl-4-(4-nitro-phenyl)-1,4-dihydro-pyridine-3,5-dicarboxylic acid 5-{[3-(4,4-diphenyl-piperidin-1-yl)-propyl]-amide} 3-ethylamide | CHEMBL95253
TypeSmall organic molecule
Emp. Form.C40H50N6O5
Mol. Mass.694.8622
SMILESCCNC(=O)C1C(C(C(=O)NCCCN2CCC(CC2)(c2ccccc2)c2ccccc2)=C(CC)N=C1COCCN)c1ccc(cc1)[N+]([O-])=O