Reaction Details
TargetTransient receptor potential cation channel subfamily V member 1
LigandBDBM50082239
Substrate/Competitorn/a
Meas. Tech.ChEBML_215486
Ki 404±n/a nM
Citation Lee, JPark, SUKim, JYKim, JKLee, JOh, UMarquez, VEBeheshti, MWang, QJModarres, SBlumberg, PM 3-Acyloxy-2-phenalkylpropyl amides and esters of homovanillic acid as novel vanilloid receptor agonists. Bioorg Med Chem Lett9:2909-14 (1999) Transient receptor potential cation channel subfamily V member 1
Name:Transient receptor potential cation channel subfamily V member 1
Type:Transient Receptor
Mol. Mass.:94956.12
Organism:Rattus norvegicus (rat)
Description:O35433
Residue:838
BDBM50082239
NameBDBM50082239
Synonyms:2,2-Dimethyl-propionic acid 2-benzyl-3-[2-(4-hydroxy-3-methoxy-phenyl)-acetylamino]-propyl ester | CHEMBL101866
TypeSmall organic molecule
Emp. Form.C24H31NO5
Mol. Mass.413.5066
SMILESCOc1cc(CC(=O)NCC(COC(=O)C(C)(C)C)Cc2ccccc2)ccc1O