Reaction Details
TargetTransient receptor potential cation channel subfamily V member 1
LigandBDBM50082243
Substrate/Competitorn/a
Meas. Tech.ChEBML_215486
Ki 480±n/a nM
Citation Lee, JPark, SUKim, JYKim, JKLee, JOh, UMarquez, VEBeheshti, MWang, QJModarres, SBlumberg, PM 3-Acyloxy-2-phenalkylpropyl amides and esters of homovanillic acid as novel vanilloid receptor agonists. Bioorg Med Chem Lett9:2909-14 (1999) Transient receptor potential cation channel subfamily V member 1
Name:Transient receptor potential cation channel subfamily V member 1
Type:Transient Receptor
Mol. Mass.:94956.12
Organism:Rattus norvegicus (rat)
Description:O35433
Residue:838
BDBM50082243
NameBDBM50082243
Synonyms:(E)-4-Benzyl-5-[2-(4-hydroxy-3-methoxy-phenyl)-acetylamino]-pent-2-enoic acid tert-butyl ester | CHEMBL97968
TypeSmall organic molecule
Emp. Form.C25H31NO5
Mol. Mass.425.5173
SMILESCOc1cc(CC(=O)NCC(Cc2ccccc2)\C=C\C(=O)OC(C)(C)C)ccc1O