Reaction Details
TargetTransient receptor potential cation channel subfamily V member 1
LigandBDBM50082252
Substrate/Competitorn/a
Meas. Tech.ChEBML_215486
Ki 5310±n/a nM
Citation Lee, JPark, SUKim, JYKim, JKLee, JOh, UMarquez, VEBeheshti, MWang, QJModarres, SBlumberg, PM 3-Acyloxy-2-phenalkylpropyl amides and esters of homovanillic acid as novel vanilloid receptor agonists. Bioorg Med Chem Lett9:2909-14 (1999) Transient receptor potential cation channel subfamily V member 1
Name:Transient receptor potential cation channel subfamily V member 1
Type:Transient Receptor
Mol. Mass.:94956.12
Organism:Rattus norvegicus (rat)
Description:O35433
Residue:838
BDBM50082252
NameBDBM50082252
Synonyms:7-Methyl-oct-6-enoic acid 4-hydroxy-3-methoxy-benzylamide | CHEMBL99504
TypeSmall organic molecule
Emp. Form.C17H25NO3
Mol. Mass.291.3853
SMILES[#6]-[#8]-c1cc(-[#6]-[#7]-[#6](=O)-[#6]-[#6]-[#6]-[#6]\[#6]=[#6](\[#6])-[#6])ccc1-[#8]