Reaction Details
TargetTransient receptor potential cation channel subfamily V member 1
LigandBDBM50082250
Substrate/Competitorn/a
Meas. Tech.ChEBML_215486
Ki 295±n/a nM
Citation Lee, JPark, SUKim, JYKim, JKLee, JOh, UMarquez, VEBeheshti, MWang, QJModarres, SBlumberg, PM 3-Acyloxy-2-phenalkylpropyl amides and esters of homovanillic acid as novel vanilloid receptor agonists. Bioorg Med Chem Lett9:2909-14 (1999) Transient receptor potential cation channel subfamily V member 1
Name:Transient receptor potential cation channel subfamily V member 1
Type:Transient Receptor
Mol. Mass.:94956.12
Organism:Rattus norvegicus (rat)
Description:O35433
Residue:838
BDBM50082250
NameBDBM50082250
Synonyms:2,2-Dimethyl-propionic acid 2-{[2-(4-hydroxy-3-methoxy-phenyl)-acetylamino]-methyl}-4-phenyl-butyl ester | CHEMBL101775
TypeSmall organic molecule
Emp. Form.C25H33NO5
Mol. Mass.427.5332
SMILESCOc1cc(CC(=O)NCC(CCc2ccccc2)COC(=O)C(C)(C)C)ccc1O