Reaction Details
TargetDelta-type opioid receptor
LigandBDBM50039026
Substrate/Competitorn/a
Meas. Tech.ChEBML_53430
Ki 0.910000±n/a nM
Citation Thomas, JBHerault, XMRothman, RBBurgess, JPMascarella, SWXu, HHorel, RBDersch, CMCarroll, FI (+/-)-4-[(N-allyl-cis-3-methyl-4-piperidinyl)phenylamino]-N,N-diethylbenzamide displays selective binding for the delta opioid receptor. Bioorg Med Chem Lett9:3053-6 (1999) Delta-type opioid receptor
Name:Delta-type opioid receptor
Type:Enzyme Catalytic Domain
Mol. Mass.:40577.25
Organism:MOUSE
Description:P32300
Residue:372
BDBM50039026
NameBDBM50039026
Synonyms:4-((R)-((2S,5R)-4-allyl-2,5-dimethylpiperazin-1-yl)(3-hydroxyphenyl)methyl)-N,N-diethylbenzamide 4-[(4-Allyl-2,5-dimethyl-piperazin-1-yl)-(3-hydroxy-phenyl)-methyl]-N,N-diethyl-benzamide(SNC-86) BW-373U86 SNC-86
TypeSmall organic molecule
Emp. Form.C27H37N3O2
Mol. Mass.435.6016
SMILESCCN(CC)C(=O)c1ccc(cc1)[C@@H](N1C[C@@H](C)N(CC=C)C[C@@H]1C)c1cccc(O)c1