Reaction Details
TargetKappa-type opioid receptor
LigandBDBM50082342
Substrate/Competitorn/a
Meas. Tech.ChEBML_92552
Ki 8695±n/a nM
Citation Thomas, JBHerault, XMRothman, RBBurgess, JPMascarella, SWXu, HHorel, RBDersch, CMCarroll, FI (+/-)-4-[(N-allyl-cis-3-methyl-4-piperidinyl)phenylamino]-N,N-diethylbenzamide displays selective binding for the delta opioid receptor. Bioorg Med Chem Lett9:3053-6 (1999) Kappa-type opioid receptor
Name:Kappa-type opioid receptor
Type:G Protein-Coupled Receptor (GPCR)
Mol. Mass.:42648.76
Organism:Homo sapiens (Human)
Description:P41145
Residue:380
BDBM50082342
NameBDBM50082342
Synonyms:4-[((3S,4S)-1-Allyl-3-methyl-piperidin-4-yl)-phenyl-amino]-N,N-diethyl-benzamide | CHEMBL321092
TypeSmall organic molecule
Emp. Form.C26H35N3O
Mol. Mass.405.5756
SMILESCCN(CC)C(=O)c1ccc(cc1)N([C@H]1CCN(CC=C)C[C@@H]1C)c1ccccc1