Reaction Details
TargetCapsid scaffolding protein
LigandBDBM50082152
Substrate/Competitorn/a
Meas. Tech.ChEBML_158969
IC50 14±n/a nM
Citation Smith, DGGribble, ADHaigh, DIfe, RJLavery, PSkett, PSlingsby, BPStacey, RWard, RWWest, A The inhibition of human cytomegalovirus (hCMV) protease by hydroxylamine derivatives. Bioorg Med Chem Lett9:3137-42 (1999) Capsid scaffolding protein
Name:Capsid scaffolding protein
Type:PROTEIN
Mol. Mass.:73854.16
Organism:Human cytomegalovirus (strain AD169) (HHV-5) (Human herpesvirus 5)
Description:ChEMBL_158958
Residue:708
BDBM50082152
NameBDBM50082152
Synonyms:2-[4-(4-Hydroxyamino-benzoyl)-benzyl]-5-methyl-thieno[2,3-d][1,3]oxazin-4-one | CHEMBL107126
TypeSmall organic molecule
Emp. Form.C21H16N2O4S
Mol. Mass.392.428
SMILESCc1csc2nc(Cc3ccc(cc3)C(=O)c3ccc(NO)cc3)oc(=O)c12