Reaction Details
TargetCapsid scaffolding protein
LigandBDBM50082157
Substrate/Competitorn/a
Meas. Tech.ChEBML_158969
IC50 55±n/a nM
Citation Smith, DGGribble, ADHaigh, DIfe, RJLavery, PSkett, PSlingsby, BPStacey, RWard, RWWest, A The inhibition of human cytomegalovirus (hCMV) protease by hydroxylamine derivatives. Bioorg Med Chem Lett9:3137-42 (1999) Capsid scaffolding protein
Name:Capsid scaffolding protein
Type:PROTEIN
Mol. Mass.:73854.16
Organism:Human cytomegalovirus (strain AD169) (HHV-5) (Human herpesvirus 5)
Description:ChEMBL_158958
Residue:708
BDBM50082157
NameBDBM50082157
Synonyms:5-Methyl-2-[4-(3-nitroso-benzoyl)-benzyl]-thieno[2,3-d][1,3]oxazin-4-one | CHEMBL107078
TypeSmall organic molecule
Emp. Form.C21H14N2O4S
Mol. Mass.390.412
SMILESCc1csc2nc(Cc3ccc(cc3)C(=O)c3cccc(c3)N=O)oc(=O)c12