Reaction Details
Target5-hydroxytryptamine receptor 1A
LigandBDBM50082410
Substrate/Competitorn/a
Meas. Tech.ChEMBL_941 (CHEMBL616120)
Ki 2.3±n/a nM
Citation van Niel, MBBeer, MSCastro, JLCheng, SKEvans, DCHeald, AHitzel, LHunt, PMortishire-Smith, RO'Connor, DWatt, APMacLeod, AM Parallel synthesis of 3-aryloxy-2-propanolamines and evaluation as dual affinity 5-HT(1A) and 5-HT re-uptake ligands. Bioorg Med Chem Lett9:3243-8 (1999) 5-hydroxytryptamine receptor 1A
Name:5-hydroxytryptamine receptor 1A
Type:n/a
Mol. Mass.:46122.49
Organism:Homo sapiens (Human)
Description:n/a
Residue:422
BDBM50082410
NameBDBM50082410
Synonyms:4-fluoro-7-[2-hydroxy-3-spiro[1,3-dihydrobenzo[e]isobenzofuran-3,4'-(hexahydropyridine)]-1-ylpropoxy]-1-indanone | CHEMBL111713
TypeSmall organic molecule
Emp. Form.C28H28FNO4
Mol. Mass.461.5246
SMILESOC(COc1ccc(F)c2CCC(=O)c12)CN1CCC2(CC1)OCc1c2ccc2ccccc12