Reaction Details
TargetDelta-type opioid receptor
LigandBDBM21130
Substrate/Competitorn/a
Meas. Tech.ChEMBL_53442 (CHEMBL666292)
Kd 1980±n/a nM
Citation Thomas, JBAtkinson, RNHerault, XMRothman, RBMascarella, SWDersch, CMXu, HHorel, RBCarroll, FI Optically pure (-)-4-[(N-allyl-3-methyl-4-piperidinyl)phenyl-amino]-N,N-diethylbenzami de displays selective binding and full agonist activity for the delta opioid receptor. Bioorg Med Chem Lett9:3347-50 (2000) Delta-type opioid receptor
Name:Delta-type opioid receptor
Type:G Protein-Coupled Receptor (GPCR)
Mol. Mass.:40382.98
Organism:Homo sapiens (Human)
Description:Competition binding assays were carried out using membrane preparations from transfected HN9.10 cells that constitutively expressed the delta opioid receptor.
Residue:372
BDBM21130
NameBDBM21130
Synonyms:N-methyl-2-phenyl-N-[(5R,7S,8S)-7-(pyrrolidin-1-yl)-1-oxaspiro[4.5]decan-8-yl]acetamide U-69593 [3H]U69593
Typeradiolabeled ligand
Emp. Form.C22H32N2O2
Mol. Mass.356.5017
SMILESCN([C@H]1CC[C@@]2(CCCO2)C[C@@H]1N1CCCC1)C(=O)Cc1ccccc1