Reaction Details
TargetMu-type opioid receptor
LigandBDBM50083636
Substrate/Competitorn/a
Meas. Tech.ChEMBL_138732 (CHEMBL747754)
Kd 4667±n/a nM
Citation Thomas, JBAtkinson, RNHerault, XMRothman, RBMascarella, SWDersch, CMXu, HHorel, RBCarroll, FI Optically pure (-)-4-[(N-allyl-3-methyl-4-piperidinyl)phenyl-amino]-N,N-diethylbenzami de displays selective binding and full agonist activity for the delta opioid receptor. Bioorg Med Chem Lett9:3347-50 (2000) Mu-type opioid receptor
Name:Mu-type opioid receptor
Type:Enzyme Catalytic Domain
Mol. Mass.:11165.58
Organism:GUINEA PIG
Description:P97266
Residue:98
BDBM50083636
NameBDBM50083636
Synonyms:4-[(1-Allyl-3-methyl-piperidin-4-yl)-phenyl-amino]-N,N-diethyl-benzamide | CHEMBL115730
TypeSmall organic molecule
Emp. Form.C26H35N3O
Mol. Mass.405.5756
SMILESCCN(CC)C(=O)c1ccc(cc1)N(C1CCN(CC=C)CC1C)c1ccccc1