Reaction Details
TargetPlasma kallikrein
LigandBDBM50074916
Substrate/Competitorn/a
Meas. Tech.ChEBML_92394
Ki 500±n/a nM
Citation Garrett, GSMcPhail, SJTornheim, KCorrea, PEMcIver, JM Synthesis of potent and selective inhibitors of human plasma kallikrein. Bioorg Med Chem Lett9:301-6 (1999) Plasma kallikrein
Name:Plasma kallikrein
Type:Protein
Mol. Mass.:71391.16
Organism:Homo sapiens (Human)
Description:P03952
Residue:638
BDBM50074916
NameBDBM50074916
Synonyms:[(R)-2,2-Dimethyl-1-({(S)-naphthalen-2-yl-[3,3,3-trifluoro-1-(4-guanidino-benzyl)-2-oxo-propylcarbamoyl]-methyl}-carbamoyl)-propyl]-carbamic acid adamantan-1-yl ester
TypeSmall organic molecule
Emp. Form.C40H48F3N6O5
Mol. Mass.749.841
SMILESCC(C)(C)[C@@H](NC(=O)OC12CC3CC(CC(C3)C1)C2)C(=O)N[C@H](C(=O)NC(Cc1ccc(NC(N)=[NH2+])cc1)C(=O)C(F)(F)F)c1ccc2ccccc2c1