Reaction Details
TargetPlasma kallikrein
LigandBDBM50074918
Substrate/Competitorn/a
Meas. Tech.ChEBML_92394
Ki 2±n/a nM
Citation Garrett, GSMcPhail, SJTornheim, KCorrea, PEMcIver, JM Synthesis of potent and selective inhibitors of human plasma kallikrein. Bioorg Med Chem Lett9:301-6 (1999) Plasma kallikrein
Name:Plasma kallikrein
Type:Protein
Mol. Mass.:71391.16
Organism:Homo sapiens (Human)
Description:P03952
Residue:638
BDBM50074918
NameBDBM50074918
Synonyms:((R)-2,2-Dimethyl-1-{(S)-2-phenyl-1-[3,3,3-trifluoro-1-(4-guanidino-benzyl)-2-oxo-propylcarbamoyl]-ethylcarbamoyl}-propyl)-carbamic acid adamantan-1-yl ester
TypeSmall organic molecule
Emp. Form.C37H48F3N6O5
Mol. Mass.713.8089
SMILESCC(C)(C)[C@@H](NC(=O)OC12CC3CC(CC(C3)C1)C2)C(=O)N[C@@H](Cc1ccccc1)C(=O)NC(Cc1ccc(NC(N)=[NH2+])cc1)C(=O)C(F)(F)F