Reaction Details
TargetAminopeptidase N
LigandBDBM50075336
Substrate/Competitorn/a
Meas. Tech.ChEMBL_35494 (CHEMBL646404)
IC50 98400±n/a nM
Citation Shimazawa, RTakayama, HKato, FKato, MHashimoto, Y Nonpeptide small-molecular inhibitors of dipeptidyl peptidase IV: N-phenylphthalimide analogs. Bioorg Med Chem Lett9:559-62 (1999) Aminopeptidase N
Name:Aminopeptidase N
Type:PROTEIN
Mol. Mass.:109522.63
Organism:Homo sapiens (Human)
Description:ChEMBL_1507526
Residue:967
BDBM50075336
NameBDBM50075336
Synonyms:2-(2,6-Diisopropyl-phenyl)-4,5,6,7-tetrafluoro-isoindole-1,3-dithione | CHEMBL153037
TypeSmall organic molecule
Emp. Form.C20H17F4NS2
Mol. Mass.411.479
SMILESCC(C)c1cccc(C(C)C)c1N1C(=S)c2c(C1=S)c(F)c(F)c(F)c2F