Reaction Details
TargetAminopeptidase N
LigandBDBM50066441
Substrate/Competitorn/a
Meas. Tech.ChEMBL_35494 (CHEMBL646404)
IC50>397000±n/a nM
Citation Shimazawa, RTakayama, HKato, FKato, MHashimoto, Y Nonpeptide small-molecular inhibitors of dipeptidyl peptidase IV: N-phenylphthalimide analogs. Bioorg Med Chem Lett9:559-62 (1999) Aminopeptidase N
Name:Aminopeptidase N
Type:PROTEIN
Mol. Mass.:109522.63
Organism:Homo sapiens (Human)
Description:ChEMBL_1507526
Residue:967
BDBM50066441
NameBDBM50066441
Synonyms:2-(2,6-Dimethyl-phenyl)-isoindole-1,3-dione CHEMBL8916
TypeSmall organic molecule
Emp. Form.C16H13NO2
Mol. Mass.251.2799
SMILESCc1cccc(C)c1N1C(=O)c2ccccc2C1=O