Reaction Details
TargetAminopeptidase N
LigandBDBM50075328
Substrate/Competitorn/a
Meas. Tech.ChEBML_35494
IC50 46400±n/a nM
Citation Shimazawa, RTakayama, HKato, FKato, MHashimoto, Y Nonpeptide small-molecular inhibitors of dipeptidyl peptidase IV: N-phenylphthalimide analogs. Bioorg Med Chem Lett9:559-62 (1999) Aminopeptidase N
Name:Aminopeptidase N
Type:PROTEIN
Mol. Mass.:109522.63
Organism:Homo sapiens (Human)
Description:ChEMBL_1507526
Residue:967
BDBM50075328
NameBDBM50075328
Synonyms:2-(2,6-Diisopropyl-phenyl)-5-hydroxy-isoindole-1,3-dione CHEMBL313952
TypeSmall organic molecule
Emp. Form.C20H21NO3
Mol. Mass.323.3856
SMILESCC(C)c1cccc(C(C)C)c1N1C(=O)c2ccc(O)cc2C1=O