Reaction Details
TargetDelta-type opioid receptor
LigandBDBM50076007
Substrate/Competitorn/a
Meas. Tech.ChEBML_217729
Ki 1.3±n/a nM
Citation Husbands, SMBreeden, SWGrivas, KLewis, JW Ring constrained analogues of the orvinols: the furanomorphides. Bioorg Med Chem Lett9:831-4 (1999) Delta-type opioid receptor
Name:Delta-type opioid receptor
Type:G Protein-Coupled Receptor (GPCR)
Mol. Mass.:40382.98
Organism:Homo sapiens (Human)
Description:Competition binding assays were carried out using membrane preparations from transfected HN9.10 cells that constitutively expressed the delta opioid receptor.
Residue:372
BDBM50076007
NameBDBM50076007
Synonyms:2-(11,15-dimethoxy-3-methyl-13-oxa-3-azahexacyclo[13.2.2.12,8.01,6.06,14.07,12]icosa-7,9,11-trien-16-yl)-3-methyl-2-butanol | CHEMBL355296
TypeSmall organic molecule
Emp. Form.C26H37NO4
Mol. Mass.427.5763
SMILESCOc1ccc2C[C@H]3N(C)CCC45[C@@H](Oc1c24)[C@@]1(CCC35C[C@@H]1[C@](C)(O)C(C)C)OC