Reaction Details
TargetMu-type opioid receptor
LigandBDBM50451004
Substrate/Competitorn/a
Meas. Tech.ChEBML_221911
Ki 0.600000±n/a nM
Citation Husbands, SMBreeden, SWGrivas, KLewis, JW Ring constrained analogues of the orvinols: the furanomorphides. Bioorg Med Chem Lett9:831-4 (1999) Mu-type opioid receptor
Name:Mu-type opioid receptor
Type:Enzyme Catalytic Domain
Mol. Mass.:11165.58
Organism:GUINEA PIG
Description:P97266
Residue:98
BDBM50451004
NameBDBM50451004
Synonyms:CHEMBL2110315
TypeSmall organic molecule
Emp. Form.C25H33NO3
Mol. Mass.395.5344
SMILES[H][C@@]12C[C@]34CC[C@]1(OC(C)(C)C2(C)C)[C@]1([H])Oc2c5c(CC3N(C)CC[C@@]415)ccc2O