Reaction Details
TargetDelta-type opioid receptor
LigandBDBM50076009
Substrate/Competitorn/a
Meas. Tech.ChEMBL_217731 (CHEMBL823795)
EC50 5±n/a nM
Citation Husbands, SMBreeden, SWGrivas, KLewis, JW Ring constrained analogues of the orvinols: the furanomorphides. Bioorg Med Chem Lett9:831-4 (1999) Delta-type opioid receptor
Name:Delta-type opioid receptor
Type:G Protein-Coupled Receptor (GPCR)
Mol. Mass.:40382.98
Organism:Homo sapiens (Human)
Description:Competition binding assays were carried out using membrane preparations from transfected HN9.10 cells that constitutively expressed the delta opioid receptor.
Residue:372
BDBM50076009
NameBDBM50076009
Synonyms:16-[1-hydroxy-1,2,2-trimethyl-(1R)-propyl]-15-methoxy-3-methyl-(1S,14R,15R)-13-oxa-3-azahexacyclo[13.2.2.12,8.01,6.06,14.07,12]icosa-7,9,11-trien-11-ol | CHEMBL169552
TypeSmall organic molecule
Emp. Form.C26H37NO4
Mol. Mass.427.5763
SMILESCO[C@@]12CCC3(C[C@H]1[C@@](C)(O)C(C)(C)C)[C@H]1Cc4ccc(O)c5O[C@@H]2C3(CCN1C)c45